{"text_format":"1","workbook":"xlsx","n_sheets":2,"sheets":["Konfigurator","AF-Artikel"],"not_rendered":{"charts":0,"images":81,"macros":1,"external_links":0,"defined_names":2,"comments":0,"pivot_tables":0},"unopened":[],"bounds":{"document_bytes":16777216,"sheet_cells":100000,"rows_first":2000,"rows_last":500,"rows_between":2000,"halvings":0,"cell_chars":16384,"cell_head_chars":4096},"cells_cut":0,"cells_raw":0,"read":"whole","date_system":"1900"}

{"sheet":"Konfigurator","index":0,"n_rows":949,"n_cols":20,"rows_kept":949,"cut":false,"hidden":false,"merged":[[230,11,230,12],[228,11,228,12],[184,11,184,12],[186,11,186,12],[215,11,215,12],[216,11,216,12],[1,16,4,17],[39,11,39,14],[40,11,40,14],[195,11,195,12],[194,11,194,12],[181,11,181,13],[191,11,191,12],[192,11,192,12],[183,11,183,13],[185,11,185,13],[182,11,182,12],[179,11,179,13],[180,11,180,13],[598,11,598,13],[393,11,393,12],[408,11,408,13],[395,11,395,13],[396,11,396,13],[407,11,407,13],[567,11,567,13],[563,11,563,13],[233,11,233,13],[246,11,246,13],[247,11,247,12],[245,11,245,12],[243,11,243,12],[596,11,596,12],[421,11,421,12],[584,11,584,13],[585,11,585,13],[586,11,586,12],[587,11,587,12],[593,11,593,12],[594,11,594,12],[390,11,390,13],[231,11,231,12],[234,11,234,12],[581,11,581,12],[582,11,582,12],[591,11,591,13],[592,11,592,13],[608,11,608,12],[609,11,609,12],[610,11,610,12],[602,11,602,12],[603,11,603,12],[605,11,605,13],[606,11,606,13],[561,11,561,12],[560,11,560,13],[574,11,574,12],[575,11,575,12],[577,11,577,13],[578,11,578,13],[579,11,579,12],[580,11,580,12],[566,11,566,13],[599,11,599,13],[405,11,405,12],[631,11,631,12],[623,11,623,12],[624,11,624,12],[626,11,626,13],[627,11,627,13],[628,11,628,12],[629,11,629,12],[630,11,630,12],[588,11,588,12],[589,11,589,12],[619,11,619,13],[620,11,620,13],[614,11,614,12],[615,11,615,12],[616,11,616,12],[617,11,617,12],[601,11,601,12],[607,11,607,12],[612,11,612,13],[613,11,613,13],[621,11,621,12],[622,11,622,12],[600,11,600,12],[595,11,595,12],[572,11,572,12],[573,11,573,12],[570,11,570,13],[571,11,571,13],[564,11,564,13],[565,11,565,12],[568,11,568,12],[532,11,532,12],[533,11,533,12],[552,11,552,12],[553,11,553,12],[554,11,554,12],[558,11,558,12],[556,11,556,13],[557,11,557,13],[559,11,559,13],[551,11,551,12],[544,11,544,12],[545,11,545,12],[547,11,547,12],[549,11,549,13],[550,11,550,13],[528,11,528,13],[542,11,542,13],[546,11,546,12],[538,11,538,12],[539,11,539,12],[540,11,540,12],[543,11,543,12],[537,11,537,12],[529,11,529,13],[530,11,530,12],[523,11,523,12],[524,11,524,12],[525,11,525,12],[517,11,517,12],[520,11,520,12],[526,11,526,12],[536,11,536,12],[535,11,535,13],[531,11,531,12],[516,11,516,13],[521,11,521,12],[518,11,518,13],[519,11,519,12],[511,11,511,13],[513,11,513,13],[514,11,514,13],[515,11,515,12],[522,11,522,12],[501,11,501,13],[504,11,504,13],[498,11,498,12],[500,11,500,12],[502,11,502,12],[505,11,505,13],[507,11,507,13],[509,11,509,13],[510,11,510,12],[508,11,508,12],[506,11,506,12],[479,11,479,12],[480,11,480,12],[481,11,481,12],[482,11,482,12],[492,11,492,12],[488,11,488,12],[489,11,489,12],[494,11,494,13],[499,11,499,13],[490,11,490,12],[491,11,491,12],[484,11,484,13],[485,11,485,12],[486,11,486,12],[487,11,487,12],[495,11,495,13],[496,11,496,13],[497,11,497,13],[465,11,465,13],[466,11,466,13],[467,11,467,13],[469,11,469,13],[468,11,468,12],[476,11,476,12],[477,11,477,12],[474,11,474,13],[478,11,478,12],[470,11,470,12],[472,11,472,12],[471,11,471,13],[475,11,475,12],[460,11,460,12],[461,11,461,12],[462,11,462,12],[464,11,464,13],[455,11,455,12],[456,11,456,12],[459,11,459,12],[458,11,458,13],[447,11,447,12],[454,11,454,12],[449,11,449,13],[450,11,450,13],[453,11,453,12],[452,11,452,13],[451,11,451,12],[441,11,441,12],[444,11,444,12],[445,11,445,12],[446,11,446,12],[434,11,434,12],[435,11,435,12],[438,11,438,12],[440,11,440,12],[392,11,392,13],[425,11,425,13],[410,11,410,12],[411,11,411,12],[413,11,413,13],[414,11,414,13],[419,11,419,13],[416,11,416,12],[417,11,417,12],[422,11,422,12],[423,11,423,12],[399,11,399,12],[398,11,398,13],[401,11,401,13],[402,11,402,13],[397,11,397,12],[409,11,409,12],[415,11,415,12],[420,11,420,13],[404,11,404,12],[378,11,378,13],[371,11,371,12],[370,11,370,13],[373,11,373,13],[374,11,374,13],[385,11,385,12],[377,11,377,12],[375,11,375,13],[376,11,376,13],[387,11,387,12],[384,11,384,13],[386,11,386,13],[379,11,379,12],[381,11,381,13],[382,11,382,13],[383,11,383,13],[403,11,403,13],[391,11,391,12],[389,11,389,13],[367,11,367,12],[369,11,369,12],[366,11,366,13],[368,11,368,13],[365,11,365,12],[362,11,362,13],[363,11,363,13],[364,11,364,13],[345,11,345,13],[347,11,347,13],[340,11,340,12],[344,11,344,12],[342,11,342,13],[343,11,343,13],[356,11,356,12],[358,11,358,12],[360,11,360,12],[357,11,357,13],[359,11,359,13],[346,11,346,12],[348,11,348,12],[349,11,349,13],[352,11,352,13],[353,11,353,13],[329,11,329,12],[328,11,328,13],[331,11,331,13],[323,11,323,12],[325,11,325,12],[324,11,324,13],[326,11,326,13],[327,11,327,12],[339,11,339,13],[334,11,334,12],[332,11,332,13],[333,11,333,13],[335,11,335,13],[336,11,336,12],[338,11,338,12],[337,11,337,13],[320,11,320,13],[321,11,321,13],[322,11,322,13],[314,11,314,12],[316,11,316,12],[315,11,315,13],[317,11,317,13],[300,11,300,12],[302,11,302,13],[303,11,303,13],[304,11,304,13],[313,11,313,13],[305,11,305,12],[307,11,307,12],[306,11,306,13],[309,11,309,13],[318,11,318,12],[312,11,312,12],[310,11,310,13],[311,11,311,13],[298,11,298,12],[296,11,296,13],[297,11,297,13],[299,11,299,13],[291,11,291,12],[293,11,293,12],[292,11,292,13],[295,11,295,13],[279,11,279,12],[284,11,284,12],[285,11,285,13],[281,11,281,13],[282,11,282,13],[283,11,283,13],[289,11,289,13],[290,11,290,13],[288,11,288,13],[236,11,236,12],[237,11,237,12],[286,11,286,12],[229,11,229,12],[220,11,220,13],[213,11,213,12],[214,11,214,12],[211,11,211,13],[221,11,221,12],[244,11,244,13],[235,11,235,12],[212,11,212,12],[218,11,218,13],[267,11,267,13],[268,11,268,13],[276,11,276,13],[269,11,269,13],[226,11,226,12],[227,11,227,12],[223,11,223,12],[264,11,264,13],[278,11,278,13],[277,11,277,12],[271,11,271,13],[16,5,21,5],[175,11,175,12],[7,9,8,9],[11,9,12,9],[9,8,10,8],[9,9,10,9],[11,6,12,8],[9,6,10,7],[7,8,8,8],[7,6,8,7],[35,11,35,12],[36,11,36,12],[15,6,24,6],[171,11,171,12],[173,11,173,12],[25,11,25,13],[39,6,40,6],[170,11,170,13],[172,11,172,13],[167,11,167,13],[150,11,151,14],[168,11,168,13],[122,11,124,14],[126,11,127,14],[238,11,238,12],[242,11,242,13],[256,11,256,13],[248,11,248,12],[263,11,263,12],[249,11,249,12],[197,11,197,12],[431,11,431,13],[224,11,224,12],[225,11,225,12],[208,11,208,12],[209,11,209,12],[204,11,204,13],[205,11,205,12],[206,11,206,12],[207,11,207,12],[219,11,219,12],[222,11,222,12],[272,11,272,12],[274,11,274,13],[275,11,275,13],[265,11,265,12],[255,11,255,13],[258,11,258,13],[437,11,437,13],[443,11,443,13],[439,11,439,12],[427,11,427,12],[428,11,428,12],[429,11,429,12],[432,11,432,12],[239,11,239,12],[433,11,433,12],[355,11,355,13],[350,11,350,12],[354,11,354,12],[250,11,250,12],[252,11,252,12],[426,11,426,13],[254,11,254,13],[251,11,251,12],[270,11,270,12],[240,11,240,12],[260,11,260,13],[262,11,262,13],[261,11,261,12],[259,11,259,12],[257,11,257,12],[176,11,176,13],[177,11,177,12],[169,11,169,12],[174,11,174,13],[138,11,139,14],[145,11,148,14],[133,11,136,14],[166,11,166,13],[187,11,187,13],[189,11,189,13],[201,11,201,12],[202,11,202,12],[193,11,193,12],[198,11,198,12],[199,11,199,12],[200,11,200,12],[190,11,190,13],[196,11,196,12]]}
[1,null,null,null,null,"Kunde: ",null,"Vers.:","2.04_03",null,null,"Menge","Art.-Nr.","Artikelbeschreibung","Einzel-Liste","Einzel-EK","Gravur-Text","Reihenfolge"]
[2,null,null,null,null,"Bearbeiter: ",null,null,null,null,{"$f":"IF($A$25>1,\"Fehler\",IF(AND(H36>0,H37>0,I35<1),\"Fehler\",\"\"))","v":""},{"$f":"IF($A$25<>0,IF(VLOOKUP($A1,$A28:$I$165,1)=1,VLOOKUP($A1,$A28:$I$165,9)& \" x\",\"\"),\"\")","v":""},{"$f":"IF($A$25<>0,IF($A$1>=$A1,VLOOKUP($A1,$A$28:$H$165,8),\"\"),\"\")","v":""},{"$f":"IF($A$25<>0,IF($A$1>=$A1,VLOOKUP($A1,$A$28:$H$165,7)&IF(AND($H$36>0,$H$37>0,$M2=5016),\",  -  Breite: \"&$H$36&\"mm\"&\", Höhe: \"&$H$37&\"mm\",IF(M2=5016,\"   -   Größenangabe fehlt!\",\"\"))),\"\")","v":""},{"$f":"IF($A$25<>0,IF($A$1>=$A1,VLOOKUP($A1,$A$28:$J$165,10),\"\"),\"\")","v":""},{"$f":"IF(M2=\"\",\"\",ROUND($O2-($O2*$I$10),2))","v":""},{"$f":"IF($A$25>1,\"Mehr als 1 Anschlussfeld\",\"\")","v":""}]
[3,null,null,null,null,"Projekt: ",null,null,null,null,null,{"$f":"IF(AND($A$25=1,$I$40<>\"\"),E40&\" x\",IF(AND($A$25=1,$I$40=0,$A$24<>0),A24&\" x\",\"\"))","v":""},{"$f":"IF(OR(AND($I$40<>\"\",$I$35<>0),AND($I$40<>\"\",$I$28<>0),AND($I$40<>\"\",$I$29<>0),AND($I$40<>\"\",$I$30<>0),AND($I$40<>\"\",$I$31<>0),AND($I$40<>\"\",$I$32<>0),AND($I$40<>\"\",$I$33<>0)),$H$40,IF(AND($A$25=1,$A$24<>0),$H$40,\"\"))","v":""},{"$f":"IF(OR(AND($I$40<>\"\",$I$35<>0),AND($I$40<>\"\",$I$28<>0),AND($I$40<>\"\",$I$29<>0),AND($I$40<>\"\",$I$30<>0),AND($I$40<>\"\",$I$31<>0),AND($I$40<>\"\",$I$32<>0),AND($I$40<>\"\",$I$33<>0)),$G$39,IF(AND($A$25=1,$A$24<>0),$G$39,\"\"))","v":""},{"$f":"IF(OR(AND($I$40<>\"\",$I$35<>0),AND($I$40<>\"\",$I$28<>0),AND($I$40<>\"\",$I$29<>0),AND($I$40<>\"\",$I$30<>0),AND($I$40<>\"\",$I$31<>0),AND($I$40<>\"\",$I$32<>0),AND($I$40<>\"\",$I$33<>0)),$J$40,IF(AND($A$25=1,$A$24<>0),$J$40,\"\"))","v":""},{"$f":"IF(M3=\"\",\"\",$O3-($O3*$I$10))","v":""},null,null,null,{"$f":"SUM(T6:T25)","v":0}]
[4,null,null,null,null,"Bestell-Nummer: ",null,null,null,null,null,{"$f":"IF(AND($A$25=1,$C$123=1,$I$121>0),$E$123&\" x\",IF(AND($A$25=1,$C$124=1,$I$121>0),$E$124&\" x\",IF(AND($A$25=1,$C$125=1,$I$121>0),$E$125&\" x\",IF(AND($A$25=1,$C$134=1,$I$132>0),$E$134&\" x\",IF(AND($A$25=1,$C$135=1,$I$132>0),$E$135&\" x\",IF(AND($A$25=1,$C$136=1,$I$132>0),$E$136&\" x\",IF(AND($A$25=1,$C$137=1,$I$132>0),$E$137&\" x\",\"\")))))))&IF(AND($A$25=1,$C$146=1,$I$144>0),$E$146&\" x\",IF(AND($A$25=1,$C$147=1,$I$144>0),$E$147&\" x\",IF(AND($A$25=1,$C$148=1,$I$144>0),$E$148&\" x\",IF(AND($A$25=1,$C$149=1,$I$144>0),$E$149&\" x\",\"\"))))","v":""},{"$f":"IF(AND($A$25=1,$C$123=1,$I$121>0),$H$123,IF(AND($A$25=1,$C$124=1,$I$121>0),$H$124,IF(AND($A$25=1,$C$125=1,$I$121>0),$H$125,IF(AND($A$25=1,$C$134=1,$I$132>0),$H$134,IF(AND($A$25=1,$C$135=1,$I$132>0),$H$135,IF(AND($A$25=1,$C$136=1,$I$132>0),$H$136,IF(AND($A$25=1,$C$137=1,$I$132>0),$H$137,\"\")))))))&IF(AND($A$25=1,$C$146=1,$I$144>0),$H$146,IF(AND($A$25=1,$C$147=1,$I$144>0),$H$147,IF(AND($A$25=1,$C$148=1,$I$144>0),$H$148,IF(AND($A$25=1,$C$149=1,$I$144>0),$H$149,\"\"))))","v":""},{"$f":"IF(AND($A$25=1,$C$123=1,$I$121>0),$G$123,IF(AND($A$25=1,$C$124=1,$I$121>0),$G$124,IF(AND($A$25=1,$C$125=1,$I$121>0),$G$125,IF(AND($A$25=1,$C$134=1,$I$132>0),$G$134,IF(AND($A$25=1,$C$135=1,$I$132>0),$G$135,IF(AND($A$25=1,$C$136=1,$I$132>0),$G$136,IF(AND($A$25=1,$C$137=1,$I$132>0),$G$137,\"\")))))))&IF(AND($A$25=1,$C$148=1,$I$144>0),$G$148,IF(AND($A$25=1,$C$146=1,$I$144>0),$G$146,IF(AND($A$25=1,$C$147=1,$I$144>0),$G$147,IF(AND($A$25=1,$C$149=1,$I$144>0),$G$149,\"\"))))","v":""},{"$f":"IF(AND($A$25=1,$C$123=1,$I$121>0),$J$123,IF(AND($A$25=1,$C$124=1,$I$121>0),$J$124,IF(AND($A$25=1,$C$125=1,$I$121>0),$J$125,IF(AND($A$25=1,$C$134=1,$I$132>0),$J$134,IF(AND($A$25=1,$C$135=1,$I$132>0),$J$135,IF(AND($A$25=1,$C$136=1,$I$132>0),$J$136,IF(AND($A$25=1,$C$137=1,$I$132>0),$J$137,\"\")))))))&IF(AND($A$25=1,$C$148=1,$I$144>0),$J$148,IF(AND($A$25=1,$C$146=1,$I$144>0),$J$146,IF(AND($A$25=1,$C$147=1,$I$144>0),$J$147,IF(AND($A$25=1,$C$149=1,$I$144>0),$J$149,\"\"))))","v":""},{"$f":"IF(M4=\"\",\"\",$O4-($O4*$I$10))","v":""},null,null,null,{"$f":"SUM(T7:T26)","v":0}]
[5,null,null,null,null,"Datum: ",null,null,null,null,null,{"$f":"IF(AND($A$25=1,$C$139=1,$I$132>0),$E$139&\" x\",IF(AND($A$25=1,$C$140=1,$I$132>0),$E$140&\" x\",IF(AND($A$25=1,$C$151=1,$I$144>0),$E$151&\" x\",IF(AND($A$25=1,$C$152=1,$I$144>0),$E$152&\" x\",IF(AND($A$25=1,$C$100=1,$I$93>0),$E$100&\" x\",\"\")))))","v":""},{"$f":"IF(AND($A$25=1,$C$139=1,$I$132>0),$H$139,IF(AND($A$25=1,$C$140=1,$I$132>0),$H$140,IF(AND($A$25=1,$C$151=1,$I$144>0),$H$151,IF(AND($A$25=1,$C$152=1,$I$144>0),$H$152,IF(AND($A$25=1,$C$100=1,$I$93>0),$H$100,\"\")))))","v":""},{"$f":"IF(AND($A$25=1,$C$139=1,$I$132>0),$G$139,IF(AND($A$25=1,$C$140=1,$I$132>0),$G$140,IF(AND($A$25=1,$C$151=1,$I$144>0),$G$151,IF(AND($A$25=1,$C$152=1,$I$144>0),$G$152,IF(AND($A$25=1,$C$100=1,$I$93>0),$G$100,\"\")))))","v":""},{"$f":"IF(AND($A$25=1,$C$139=1,$I$132>0),$J$139,IF(AND($A$25=1,$C$140=1,$I$132>0),$J$140,IF(AND($A$25=1,$C$151=1,$I$144>0),$J$151,IF(AND($A$25=1,$C$152=1,$I$144>0),$J$152,IF(AND($A$25=1,$C$100=1,$I$93>0),$J$100,\"\")))))","v":""},{"$f":"IF(M5=\"\",\"\",$O5-($O5*$I$10))","v":""},null,null,null,{"$f":"SUM(T7:T26)","v":0}]
[6,null,null,null,null,null,null,null,"Kundenrabatt",null,{"$f":"IF($M6=\"\",\"\",IF($T$3=0,\"\",IF(AND($R6>0,$M6>0),\"\",\"Fehler\")))","v":""},{"$f":"IF(AND(R6=0,$A$26>=$A1),VLOOKUP($A1,$B$166:$E$950,4)& \" x\",IF(AND(R6>0,$A$26>=$A1),VLOOKUP($A1,$C$166:$E$950,3,FALSE)& \" x\",\"\"))","v":""},{"$f":"IF($A$26>=$A1,IF(AND($A$26>=$A1,$R6=0),VLOOKUP($A1,$B$166:$H$950,7),IF(AND($A$26>=$A1,$R6>0),VLOOKUP($A1,$C$166:$H$950,6,FALSE),\"\")),\"\")","v":""},{"$f":"IF($A$26>=$A1,IF(AND($A$26>=$A1,$R6=0),VLOOKUP($A1,$B$166:$H$950,6),IF(AND($A$26>=$A1,$R6>0),VLOOKUP($A1,$C$166:$H$950,5,FALSE))),\"\")","v":""},{"$f":"IF($A$26>=$A1,IF(AND($A$26>=$A1,$R6=0),VLOOKUP($A1,$B$166:$J$950,9),IF(AND($A$26>=$A1,$R6>0),VLOOKUP($A1,$C$166:$J$950,8,FALSE),\"\")),\"\")","v":""},{"$f":"IF(M6=\"\",\"\",$O6-($O6*$I$10))","v":""},{"$f":"IF($A$26>=$A1,IF(AND($A$26>=$A1,$R6=0),VLOOKUP($A1,$B$166:$L$950,11),IF(AND($A$26>=$A1,$R6>0),VLOOKUP($A1,$C$166:$N$950,10,FALSE))),\"\")","v":""},{"$f":"IF(ISNA(VLOOKUP($A1,$C$166:$O$950,15,FALSE)),0,IF($A$26>=$A1,VLOOKUP($A1,$C$166:$O$950,13,FALSE),\"\"))","v":0},{"$f":"IF($M6=\"\",\"\",IF($T$3=0,\"\",IF(AND($R6>0,$M6>0),\"\",\"Reihenfolge\")))","v":""},{"$f":"IF($R6>0,1,0)","v":0}]
[7,null,null,null,null,null,null,null,"eintragen",null,{"$f":"IF($M7=\"\",\"\",IF($T$3=0,\"\",IF(AND($R7>0,$M7>0),\"\",\"Fehler\")))","v":""},"","","","",{"$f":"IF(M7=\"\",\"\",$O7-($O7*$I$10))","v":""},"",0,{"$f":"IF($M7=\"\",\"\",IF($T$3=0,\"\",IF(AND($R7>0,$M7>0),\"\",\"Reihenfolge\")))","v":""},{"$f":"IF($R7>1,1,0)","v":0}]
[8,null,null,null,null,null,"zzgl. MwSt.  Summe: ",null,"È",{"$f":"SUM($K$28:$K$632)","v":0},"","","","","","","",0,{"$f":"IF($M8=\"\",\"\",IF($T$3=0,\"\",IF(AND($R8>0,$M8>0),\"\",\"Reihenfolge\")))","v":""},0]
[9,null,null,null,null,null,null,null,null,null,"","","","","","","",0,"",0]
[10,null,null,null,null,null,"Kundenrabatt: ",null,0,{"$f":"($J$8*I10)*-1","v":0},"","","","","","","",0,"",0]
[11,null,null,null,null,null,null,null,null,null,"","","","","","","",0,"",0]
[12,null,null,null,null,null,"zzgl. MwSt.       Ihr Netto-EK: ",null,null,{"$f":"J8+J10","v":0},"","","","","","","",0,"",0]
[13,null,null,null,null,null,null,null,null,null,"","","","","","","",0,"",0]
[14,null,null,null,null,null,null,null,null,null,"","","","","","","",0,"",0]
[15,null,null,null,null,null,"Kommentarfeld",null,null,null,"","","","","","","",0,"",0]
[16,null,null,null,null,null,null,null,null,null,"","","","","","","",0,"",0]
[17,null,null,null,null,"Die Bilder können durch anklicken und ziehen mit der Maus vergrößert werden.",null,null,null,null,"","","","","","","",0,"",0]
[18,null,null,null,null,null,null,null,null,null,"","","","","","","",0,"",0]
[19,null,null,null,null,null,null,null,null,null,"","","","","","","",0,"",0]
[20,null,null,null,null,null,null,null,null,null,"","","","","","","",0,"",0]
[21,null,null,null,null,null,null,null,null,null,"","","","","","","",0,"",0]
[22,null,null,null,null,null,null,null,null,null,"","","","","","","",0,"",0]
[null,null,null,null,null,null,null,null,null,null,"","","","","","","",0,"",0]
[{"$f":"IF(I28<>\"\",SUM(D167:D1114)*I28,IF(I29<>\"\",SUM(D167:D1114)*I29,IF(I30<>\"\",SUM(D167:D1114)*I30,IF(I31<>\"\",SUM(D167:D1114)*I31,IF(I32<>\"\",SUM(D167:D1114)*I32,IF(I33<>\"\",SUM(D167:D1114)*I33,IF(I35<>\"\",SUM(D167:D1114)*I35,0)))))))","v":0},"Menge Gravurzeichen",null,null,null,null,null,null,null,null,"","","","","","","",0,"",0]
[{"$f":"SUM(A28:A165)","v":0},"Menge Anschl-Felder",null,null,null,null,null,null,null,null,"","","","","","","",0,"",0]
[{"$f":"SUM(A166:A949)","v":0},"Menge Buchsen",null,null,null,"Bilder","Bezeichnung","Art.-Nr.","Menge","Einzelpreis","Einzel-Summe","Gravur-Text",null,null,"Reihenfolge der Bestückung (von links nach rechts)"]
["Menge","Standard-Reihe","Reihenfolge","Gravurzeichen","Kom.Menge",null,null,null,null,"Zu den Anschlüssen"]
[{"$f":"IF(I28>0,1,\"\")","v":""},{"$f":"IF($A28=1,COUNTIF($A$27:$A27,1)+1,\"\")","v":""},null,null,null,null,"19\"-Frontplatte 4mm 1HE Aluminium eloxiert (ohne Gravur)",5004,null,{"$f":"IF(ISNA(VLOOKUP($H28,'AF-Artikel'!$A$3:$D$5437,3)),\"\",VLOOKUP($H28,'AF-Artikel'!$A$3:$D$5437,3))","v":61.77},{"$f":"I28*J28","v":0}]
["",{"$f":"IF($A29=1,COUNTIF($A$27:$A28,1)+1,\"\")","v":""},null,null,null,null,"19\"-Frontplatte 4mm 2HE Aluminium eloxiert (ohne Gravur)",5005,null,{"$f":"IF(ISNA(VLOOKUP($H29,'AF-Artikel'!$A$3:$D$5437,3)),\"\",VLOOKUP($H29,'AF-Artikel'!$A$3:$D$5437,3))","v":72.239999999999995},0]
["",{"$f":"IF($A30=1,COUNTIF($A$27:$A29,1)+1,\"\")","v":""},null,null,null,null,"19\"-Frontplatte 4mm 3HE Aluminium eloxiert (ohne Gravur)",5006,null,{"$f":"IF(ISNA(VLOOKUP($H30,'AF-Artikel'!$A$3:$D$5437,3)),\"\",VLOOKUP($H30,'AF-Artikel'!$A$3:$D$5437,3))","v":81.67},0]
["",{"$f":"IF($A31=1,COUNTIF($A$27:$A30,1)+1,\"\")","v":""},null,null,null,null,"19\"-Frontplatte 4mm 4HE Aluminium eloxiert (ohne Gravur)",5007,null,{"$f":"IF(ISNA(VLOOKUP($H31,'AF-Artikel'!$A$3:$D$5437,3)),\"\",VLOOKUP($H31,'AF-Artikel'!$A$3:$D$5437,3))","v":91.09},0]
["",{"$f":"IF($A32=1,COUNTIF($A$27:$A31,1)+1,\"\")","v":""},null,null,null,null,"19\"-Frontplatte 4mm 5HE Aluminium eloxiert (ohne Gravur)",5008,null,{"$f":"IF(ISNA(VLOOKUP($H32,'AF-Artikel'!$A$3:$D$5437,3)),\"\",VLOOKUP($H32,'AF-Artikel'!$A$3:$D$5437,3))","v":101.56},0]
["",{"$f":"IF($A33=1,COUNTIF($A$27:$A32,1)+1,\"\")","v":""},null,null,null,null,"19\"-Frontplatte 4mm 6HE Aluminium eloxiert (ohne Gravur)",5009,null,{"$f":"IF(ISNA(VLOOKUP($H33,'AF-Artikel'!$A$3:$D$5437,3)),\"\",VLOOKUP($H33,'AF-Artikel'!$A$3:$D$5437,3))","v":110.98},0]
["",{"$f":"IF($A34=1,COUNTIF($A$27:$A33,1)+1,\"\")","v":""},null,null,null,null,null,null,null,"Zu den Anschlüssen"]
["",{"$f":"IF($A35=1,COUNTIF($A$27:$A34,1)+1,\"\")","v":""},null,null,null,null,"Freie Aluminium-Platte eloxiert",5016,null,{"$f":"IF(OR($H$36=0,$H$37=0),(21.987),IF(H38=1,((2*($H$36/10+$H$37/10)*(0.2094))+($H$36/10*$H$37/10*(0.1047))+(21.987)),IF(H38>1,((2*($H$36/10+$H$37/10)*0.2094)+($H$36/10*$H$37/10*0.1047)+(21.987))*H38)))","v":21.986999999999998},{"$f":"IF(OR($H$36=\"\",$H$37=\"\"),0,$I$35*$J$35)","v":0}]
[null,null,null,null,null,null,"Breite (mm) ",null,null,{"$f":"IF(OR($H$36=0,$H$37=0),(21.987),IF(L37=1,((2*($H$36/10+$H$37/10)*(0.2094))+($H$36/10*$H$37/10*(0.1047))+(21.987)),IF(L37>1,((2*($H$36/10+$H$37/10)*0.2094)+($H$36/10*$H$37/10*0.1047)+(21.987))*L37)))","v":21.986999999999998}]
[null,null,null,null,null,null,"Höhe (mm) "]
[null,null,null,null,null,null,null,{"$f":"IF(H36*H37<20000,1,1.25)","v":1}]
[null,null,null,null,null,null,"Gravur je Zeichen"]
[null,null,{"$f":"IF(I40>0,1,\"\")","v":""},null,{"$f":"IF($C$40=\"\",0,SUM($I$40*VLOOKUP($A$1,$A$28:$I$166,9)))","v":0},null,"Entweder hier Menge der Gravur-Zeichen eintragen >>>\noder gewünschte Gravur-Texte hinter die ausgewählten Anschlüsse eintragen.",5010,null,{"$f":"VLOOKUP($H$40,'AF-Artikel'!$A$3:$D$5437,3)","v":0.52},{"$f":"IF(AND($A$25=1,$I$28>0),$I$40*$J$40*$I$28,IF(AND($A$25=1,$I$29>0),$I$40*$J$40*$I$29,IF(AND($A$25=1,$I$30>0),$I$40*$J$40*$I$30,IF(AND($A$25=1,$I$31>0),$I$40*$J$40*$I$31,IF(AND($A$25=1,$I$32>0),$I$40*$J$40*$I$32,IF(AND($A$25=1,$I$33>0),$I$40*$J$40*$I$33,IF(AND($A$25=1,$I$35>0),$I$40*$J$40*$I$35,0)))))))","v":0},{"$f":"IF(I40>0,\" Gravur-Texte werden nach hier eingetragener Menge berechnet!\",\"\")","v":""}]
{"$rows_left_out":910}
{"sheet":"AF-Artikel","index":1,"n_rows":1559,"n_cols":4,"rows_kept":1559,"cut":false,"hidden":false,"merged":[]}
[0,"Nicht verfügbar!",0,"INDEXC-Text"]
[1031,"Befestigungssatz Sub-D",0.6,"Befestigungssatz Sub-D"]
[1032,"Buchsenleiste HD 15pol",0.71,"Buchsenleiste HD 15pol"]
[1033,"Stiftleiste HD 15pol",0.66,"Stiftleiste HD 15pol"]
[1034,"Buchsenleiste Sub-D 15pol",0.71,"Buchsenleiste Sub-D 15pol"]
[1035,"Buchsenleiste Sub-D 37pol",1.49,"Buchsenleiste Sub-D 37pol"]
[1036,"Buchsenleiste Sub-D 50pol",3.39,"Buchsenleiste Sub-D 50pol"]
[1037,"Buchsenleiste Sub-D 25pol",0.84,"Buchsenleiste Sub-D 25pol"]
[1038,"Buchsenleiste Sub-D 9pol",0.53,"Buchsenleiste Sub-D 9pol"]
[1039,"Stiftleiste Sub-D 50pol",3.28,"Stiftleiste Sub-D 50pol"]
[1040,"Stiftleiste Sub-D 37pol",1.66,"Stiftleiste Sub-D 37pol"]
[1041,"Stiftleiste Sub-D 25pol",0.84,"Stiftleiste Sub-D 25pol"]
[1042,"Stiftleiste Sub-D 15pol",0.66,"Stiftleiste Sub-D 15pol"]
[1043,"Stiftleiste Sub-D  9pol",0.48,"Stiftleiste Sub-D 9pol"]
[1055,"Sub-D Metallhaube   9pol EVE",5.7,"Sub-D Metallhaube 9pol Typ E"]
[1062,"Knickschutztülle Helavia Cinch",0.45,"Knickschutztülle Cinchstecker"]
[1063,"Sub-D Metallhaube  9pol 10mm Typ A",3.09,"Sub-D Metallhaube 9pol max. 10mm kurze Verriegelungsschrauben Typ A"]
[1064,"Einbaubuchse Cinch rot",3.09,"Cinch-Einbaubuchse vergoldet Rot Neutrik"]
[1065,"Einbaubuchse Cinch gelb",3.09,"Cinch-Einbaubuchse vergoldet Gelb Neutrik"]
[1066,"Einbaubuchse Cinch grün",3.09,"Cinch-Einbaubuchse vergoldet Grün Neutrik"]
[1067,"Einbaubuchse Cinch blau",3.09,"Cinch-Einbaubuchse vergoldet Blau Neutrik"]
[1068,"Einbaubuchse Cinch schwarz",3.09,"Cinch-Einbaubuchse vergoldet Schwarz Neutrik"]
[1069,"Stecker Cinch schwarz Neutrik",2.72,"Cinch-Stecker,vergoldet ,Schwarz,Neutrik mit 2 Spannzangen"]
[1070,"Stecker Cinch rot Neutrik",2.72,"Cinch-Stecker,vergoldet ,Rot,Neutrik mit 2 Spannzangen"]
[1071,"Stecker Cinch gelb Neutrik",2.72,"Cinch-Stecker,vergoldet ,Gelb,Neutrik mit 2 Spannzangen"]
[1072,"Einbaubuchse XLR 3pol",7.74,"3pol-XLR-Einbaubuchse Neutrik NC3FD-LX"]
[1073,"Einbaustecker XLR 3pol",7.15,"3pol-XLR-Einbaustecker Neutrik NC3MDL1"]
[1074,"Stecker XLR 3pol",5.88,"3pol-XLR-Stecker Neutrik NC3MXX"]
[1075,"Kupplung XLR 3pol",6.99,"3pol-XLR-Kupplung Neutrik NC3FXX"]
[1076,"Einbaubuchse RJ45-EtherCon, schneid-klemm, Neutrik",19.53,"Einbaubuchse Neutrik EtherCon-Buchse mit Schneid-Klemmanschluss"]
[1077,"Stecker RJ45 Ethercon, Neutrik",6.65,"Stecker Rj45 EtherCon, Neutrik, NE8MC"]
[1078,"ZZInaktiv Crimpzange RG 59 A",43.79,"Crimpzange BNC RG 59 Typ A"]
[1079,"Gender Changer VGA-Ku./Ku.",4.29,"Gender Changer VGA-Kupplung/Kupplung"]
[1080,"Gender Changer VGA-St./St.",3.94,"Gender Changer VGA-Stecker/Stecker"]
[1081,"Gender Changer 9pol-St./St.",3.7,"Gender Changer 9pol-Sub-D-Stecker/Stecker"]
[1082,"Gender Changer 9pol-Ku./Ku.",3.7,"Gender Changer 9pol-Sub-D-Kupplung/Kupplung"]
[1083,"Gender Changer 9pol-St./Bu.",4.29,"Gender Changer 9pol-Sub-D-Stecker/Buchse"]
[1084,"Gender Changer 15pol-Ku./Ku.",4.33,"Gender Changer 15pol-Sub-D-Kupplung/Kupplung"]
[1085,"Gender Changer 9pol-St./Bu. Nullmodem",9.74,"Gender Changer 9pol-Sub-D-Stecker/Buchse Nullmodem"]
[1086,"Einbaubuchse 3,5 Klinke stereo",1.46,"3,5mm-Stereoklinkeneinbaubuchse isoliert mit Schaltkontakt"]
{"$rows_left_out":1519}